Target
Tyrosine-protein kinase BTK
Ligand
BDBM165577
Substrate
Meas. Tech.
Enzyme Assay
IC50
0.160±n/a nM
Citation
 Liu, QWatterson, SHAhmad, S Indole carboxamide compounds US Patent  US9920031 Publication Date 3/20/2018 
Target
Name:
Tyrosine-protein kinase BTK
Synonyms:
AGMX1 Agammaglobulinaemia tyrosine kinase B cell progenitor kinase BPK BTK_HUMAN Tyrosine Kinase BTK Tyrosine-protein kinase BTK (BTK)
Type:
Enzyme
Mol. Mass.:
76289.95
Organism:
Homo sapiens (Human)
Description:
Q06187
Residue:
659
  
Inhibitor
Name:
BDBM165577
Synonyms:
US10604504, Example 191 US9688629, 189 US9688629, 191 US9920031, Example 191
Type:
Small organic molecule
Emp. Form.:
C23H21F2N3O2
Mol. Mass.:
409.4285
SMILES:
Cc1[nH]c2c(cc(F)c(-c3cc(F)cc4CN(CCc34)C(=O)C=C)c2c1C)C(N)=O
: