Target
Serine/threonine-protein kinase pim-3
Ligand
BDBM376685
Substrate
Meas. Tech.
Enzyme Assay
IC50
<10±n/a nM
Citation
 Vechorkin, OLi, YSokolsky, AWang, AZhu, WZhuo, J Heterocyclic compounds useful as pim kinase inhibitors US Patent  US9920032 Publication Date 3/20/2018 
Target
Name:
Serine/threonine-protein kinase pim-3
Synonyms:
PIM3 Serine/threonine-protein kinase pim-3 (PIM3)
Type:
Protein
Mol. Mass.:
35888.19
Organism:
Homo sapiens (Human)
Description:
Q86V86
Residue:
326
  
Inhibitor
Name:
BDBM376685
Synonyms:
N-{4-[(1R,3S,5S)-3-Amino-5-methylcyclohexyl]pyridin-3-yl}-3-(2,6-difluoro-4-hydroxyphenyl)-5-fluoroquinoline-8-carboxamide US11053215, Example 18 | US9920032, Example 18
Type:
Small organic molecule
Emp. Form.:
C28H25F3N4O2
Mol. Mass.:
506.5189
SMILES:
C[C@@H]1C[C@H](N)C[C@@H](C1)c1ccncc1NC(=O)c1ccc(F)c2cc(cnc12)-c1c(F)cc(O)cc1F
: