Target
Serine/threonine-protein kinase pim-3
Ligand
BDBM376837
Substrate
Meas. Tech.
Enzyme Assay
IC50
<10±n/a nM
Citation
 Vechorkin, OLi, YSokolsky, AWang, AZhu, WZhuo, J Heterocyclic compounds useful as pim kinase inhibitors US Patent  US9920032 Publication Date 3/20/2018 
Target
Name:
Serine/threonine-protein kinase pim-3
Synonyms:
PIM3 Serine/threonine-protein kinase pim-3 (PIM3)
Type:
Protein
Mol. Mass.:
35888.19
Organism:
Homo sapiens (Human)
Description:
Q86V86
Residue:
326
  
Inhibitor
Name:
BDBM376837
Synonyms:
Ethyl 4-(8-(4-((1R,3S,5S)-3-amino-5-methylcyclohexyl)pyridin-3-ylcarbamoyl)-5-fluoroquinolin-3-yl)piperazine-1-carboxylate US11053215, Example 168 | US9920032, Example 168
Type:
Small organic molecule
Emp. Form.:
C29H35FN6O3
Mol. Mass.:
534.625
SMILES:
CCOC(=O)N1CCN(CC1)c1cnc2c(ccc(F)c2c1)C(=O)Nc1cnccc1[C@@H]1C[C@H](C)C[C@H](N)C1
: