Target
Orexin receptor type 2
Ligand
BDBM376841
Substrate
Meas. Tech.
FLIPR Assay
IC50
20.0±n/a nM
Citation
 Kuduk, SDLiverton, NLuo, Y Methyl oxazole orexin receptor antagonists US Patent  US9920038 Publication Date 3/20/2018 
Target
Name:
Orexin receptor type 2
Synonyms:
HCRTR2 OX2R_HUMAN Orexin receptor type 2 (OR-2) Orexin receptor type 2 (OX2R) Ox-2-R | Ox2-R
Type:
Protein
Mol. Mass.:
50710.53
Organism:
Homo sapiens (Human)
Description:
O43614
Residue:
444
  
Inhibitor
Name:
BDBM376841
Synonyms:
US9920038, 2
Type:
Small organic molecule
Emp. Form.:
C21H29N3O4
Mol. Mass.:
387.4727
SMILES:
CCOc1ncccc1C(=O)N1CCCC[C@@H]1Cc1nc(c(C)o1)C(C)(C)O
: