Target
Lysine-specific histone demethylase 1A
Ligand
BDBM243413
Substrate
Meas. Tech.
Inhibition Assay
IC50
<100.0±n/a nM
Citation
 Matsumoto, SHattori, YToyofuku, MMorimoto, SDaini, MKojima, TKaku, TIto, M Cyclopropanamine compound and use thereof US Patent  US9920047 Publication Date 3/20/2018 
Target
Name:
Lysine-specific histone demethylase 1A
Synonyms:
AOF2 Flavin-containing amine oxidase domain-containing protein 2 KDM1A KIAA0601 Lysine-specific demethylase 1 (LSD1) Lysine-specific histone demethylase 1 (LSD1)
Type:
Enzyme
Mol. Mass.:
92901.01
Organism:
Homo sapiens (Human)
Description:
O60341
Residue:
852
  
Inhibitor
Name:
BDBM243413
Synonyms:
5-((1R,2R)-2-((4,4- difluorocyclohexyl)- amino)cyclopropyl)- N-(tetrahydro-2H- pyran-4- yl)thiophene-3- carboxamide US10414761, Example 47 US9718814, 47 | US9920047, 47
Type:
Small organic molecule
Emp. Form.:
C19H26F2N2O2S
Mol. Mass.:
384.484
SMILES:
FC1(F)CCC(CC1)N[C@@H]1C[C@H]1c1cc(cs1)C(=O)NC1CCOCC1
: