Target
Potassium voltage-gated channel subfamily H member 2
Ligand
BDBM376873
Substrate
Meas. Tech.
Competition Binding Assay
IC50
1000±n/a nM
Citation
 Cremonesi, SMicheli, FSemeraro, TTarsi, LLuker, TLeslie, C N-(hetero)aryl-substituted heteroyclic derivatives useful for the treatment of diseases or conditions related to the central nervous system US Patent  US9920053 Publication Date 3/20/2018 
Target
Name:
Potassium voltage-gated channel subfamily H member 2
Synonyms:
1,3-beta-glucan synthase component GLS2 ERG Eag-related protein 1 Ether-a-go-go-related gene (HERG) Ether-a-go-go-related gene potassium channel 1 Ether-a-go-go-related gene potassium channel 1 (hERG1) Ether-a-go-go-related protein 1 H-ERG KCNH2 Potassium voltage-gated channel subfamily H member 2 (hERG) Voltage-gated potassium channel subunit Kv11.1 hERG Potassium Channel 1 | putative potassium channel subunit
Type:
Multi-pass membrane protein
Mol. Mass.:
126672.65
Organism:
Homo sapiens (Human)
Description:
Q12809
Residue:
1159
  
Inhibitor
Name:
BDBM376873
Synonyms:
4-[(cyclopropylamino)methyl]-1-[4-(3-fluorophenoxy)-6-(trifluoromethyl)pyrimidin-2-yl]piperidin-4-ol (E3) | US9920053, Example 3
Type:
Small organic molecule
Emp. Form.:
C20H22F4N4O2
Mol. Mass.:
426.4079
SMILES:
OC1(CNC2CC2)CCN(CC1)c1nc(Oc2cccc(F)c2)cc(n1)C(F)(F)F
: