Target
Sodium-dependent serotonin transporter
Ligand
BDBM376876
Substrate
Meas. Tech.
Competition Binding Assay
IC50
32359±n/a nM
Citation
 Cremonesi, SMicheli, FSemeraro, TTarsi, LLuker, TLeslie, C N-(hetero)aryl-substituted heteroyclic derivatives useful for the treatment of diseases or conditions related to the central nervous system US Patent  US9920053 Publication Date 3/20/2018 
Target
Name:
Sodium-dependent serotonin transporter
Synonyms:
5-HT Transporter 5HTT SC6A4_HUMAN SLC6A4 Serotonin transporter (5HTT) Sodium-dependent serotonin transporter (SERT) | Solute carrier family 6 member 4
Type:
Multi-pass membrane protein
Mol. Mass.:
70322.51
Organism:
Homo sapiens (Human)
Description:
P31645
Residue:
630
  
Inhibitor
Name:
BDBM376876
Synonyms:
4-[(3,3-difluoropyrrolidin-1-yl)methyl]-1-[4-(3-fluorophenoxy)-6-(trifluoromethyl)pyrimidin-2-yl]piperidin-4-ol (E6) | US9920053, Example 6
Type:
Small organic molecule
Emp. Form.:
C21H22F6N4O2
Mol. Mass.:
476.4154
SMILES:
OC1(CN2CCC(F)(F)C2)CCN(CC1)c1nc(Oc2cccc(F)c2)cc(n1)C(F)(F)F
: