Target
Sodium-dependent dopamine transporter
Ligand
BDBM376880
Substrate
Meas. Tech.
Competition Binding Assay
IC50
66.1±n/a nM
Citation
 Cremonesi, SMicheli, FSemeraro, TTarsi, LLuker, TLeslie, C N-(hetero)aryl-substituted heteroyclic derivatives useful for the treatment of diseases or conditions related to the central nervous system US Patent  US9920053 Publication Date 3/20/2018 
Target
Name:
Sodium-dependent dopamine transporter
Synonyms:
DA transporter DAT1 Dopamine transporter protein (DAT) SC6A3_HUMAN Sodium-dependent dopamine transporter Solute carrier family 6 member 3
Type:
Multi-pass membrane protein
Mol. Mass.:
68497.11
Organism:
Homo sapiens (Human)
Description:
Q01959
Residue:
620
  
Inhibitor
Name:
BDBM376880
Synonyms:
1-({1-[4-(3-fluorophenoxy)-6-(trifluoromethyl)pyrimidin-2-yl]-4-hydroxypiperidin-4-yl}methyl)pyrrolidin-2-one (E10) | US9920053, Example 10
Type:
Small organic molecule
Emp. Form.:
C21H22F4N4O3
Mol. Mass.:
454.418
SMILES:
OC1(CN2CCCC2=O)CCN(CC1)c1nc(Oc2cccc(F)c2)cc(n1)C(F)(F)F
: