Target
Sodium-dependent noradrenaline transporter
Ligand
BDBM376881
Substrate
Meas. Tech.
Competition Binding Assay
IC50
347±n/a nM
Citation
 Cremonesi, SMicheli, FSemeraro, TTarsi, LLuker, TLeslie, C N-(hetero)aryl-substituted heteroyclic derivatives useful for the treatment of diseases or conditions related to the central nervous system US Patent  US9920053 Publication Date 3/20/2018 
Target
Name:
Sodium-dependent noradrenaline transporter
Synonyms:
Monoamine transporter NET Noradrenaline Transporter (NET) Norepinephrine transporter protein (NET) SLC6A2 Sodium-dependent noradrenaline transporter (NET) | Solute carrier family 6 member 2
Type:
Multi-pass membrane protein
Mol. Mass.:
69337.72
Organism:
Homo sapiens (Human)
Description:
P23975
Residue:
617
  
Inhibitor
Name:
BDBM376881
Synonyms:
4-(aminomethyl)-1-[4-(3-fluorophenoxy)-6-(trifluoromethyl)pyrimidin-2-yl]piperidin-4-ol (E11) US9920053, Example 12
Type:
Small organic molecule
Emp. Form.:
C17H18F4N4O2
Mol. Mass.:
386.344
SMILES:
NCC1(O)CCN(CC1)c1nc(Oc2cccc(F)c2)cc(n1)C(F)(F)F
: