Target
Sodium-dependent noradrenaline transporter
Ligand
BDBM376901
Substrate
Meas. Tech.
Competition Binding Assay
IC50
138±n/a nM
Citation
 Cremonesi, SMicheli, FSemeraro, TTarsi, LLuker, TLeslie, C N-(hetero)aryl-substituted heteroyclic derivatives useful for the treatment of diseases or conditions related to the central nervous system US Patent  US9920053 Publication Date 3/20/2018 
Target
Name:
Sodium-dependent noradrenaline transporter
Synonyms:
Monoamine transporter NET Noradrenaline Transporter (NET) Norepinephrine transporter protein (NET) SLC6A2 Sodium-dependent noradrenaline transporter (NET) | Solute carrier family 6 member 2
Type:
Multi-pass membrane protein
Mol. Mass.:
69337.72
Organism:
Homo sapiens (Human)
Description:
P23975
Residue:
617
  
Inhibitor
Name:
BDBM376901
Synonyms:
(3S or 3R)-3-[(cyclopropylamino)methyl]-1-[4-(3-fluorophenoxy)-6-(trifluoromethyl)pyrimidin-2-yl]pyrrolidin-3-ol (E31) and (3R or 3S)-3-[(cyclopropylamino)methyl]-1-[4-(3-fluorophenoxy)-6-(trifluoromethyl)pyrimidin-2-yl]pyrrolidin-3-ol (E32) | US9920053, Example 31
Type:
Small organic molecule
Emp. Form.:
C19H20F4N4O2
Mol. Mass.:
412.3813
SMILES:
O[C@]1(CNC2CC2)CCN(C1)c1nc(Oc2cccc(F)c2)cc(n1)C(F)(F)F
: