Target
Sodium-dependent noradrenaline transporter
Ligand
BDBM376906
Substrate
Meas. Tech.
Competition Binding Assay
IC50
30.9±n/a nM
Citation
 Cremonesi, SMicheli, FSemeraro, TTarsi, LLuker, TLeslie, C N-(hetero)aryl-substituted heteroyclic derivatives useful for the treatment of diseases or conditions related to the central nervous system US Patent  US9920053 Publication Date 3/20/2018 
Target
Name:
Sodium-dependent noradrenaline transporter
Synonyms:
Monoamine transporter NET Noradrenaline Transporter (NET) Norepinephrine transporter protein (NET) SLC6A2 Sodium-dependent noradrenaline transporter (NET) | Solute carrier family 6 member 2
Type:
Multi-pass membrane protein
Mol. Mass.:
69337.72
Organism:
Homo sapiens (Human)
Description:
P23975
Residue:
617
  
Inhibitor
Name:
BDBM376906
Synonyms:
6-[4-(3-fluorophenoxy)-6-(trifluoromethyl)pyrimidin-2-yl]-decahydro-1,6-naphthyridine hydrochloride (E39) | US9920053, Example 39
Type:
Small organic molecule
Emp. Form.:
C19H20F4N4O
Mol. Mass.:
396.3819
SMILES:
Fc1cccc(Oc2cc(nc(n2)N2CCC3NCCCC3C2)C(F)(F)F)c1
: