Target
Sodium-dependent serotonin transporter
Ligand
BDBM376906
Substrate
Meas. Tech.
Competition Binding Assay
IC50
3020±n/a nM
Citation
 Cremonesi, SMicheli, FSemeraro, TTarsi, LLuker, TLeslie, C N-(hetero)aryl-substituted heteroyclic derivatives useful for the treatment of diseases or conditions related to the central nervous system US Patent  US9920053 Publication Date 3/20/2018 
Target
Name:
Sodium-dependent serotonin transporter
Synonyms:
5-HT Transporter 5HTT SC6A4_HUMAN SLC6A4 Serotonin transporter (5HTT) Sodium-dependent serotonin transporter (SERT) | Solute carrier family 6 member 4
Type:
Multi-pass membrane protein
Mol. Mass.:
70322.51
Organism:
Homo sapiens (Human)
Description:
P31645
Residue:
630
  
Inhibitor
Name:
BDBM376906
Synonyms:
6-[4-(3-fluorophenoxy)-6-(trifluoromethyl)pyrimidin-2-yl]-decahydro-1,6-naphthyridine hydrochloride (E39) | US9920053, Example 39
Type:
Small organic molecule
Emp. Form.:
C19H20F4N4O
Mol. Mass.:
396.3819
SMILES:
Fc1cccc(Oc2cc(nc(n2)N2CCC3NCCCC3C2)C(F)(F)F)c1
: