Target
Nuclear receptor ROR-gamma
Ligand
BDBM190304
Substrate
IC50
5.70±n/a nM
Citation
 Schnute, ME Methyl- and trifluoromethyl-substituted pyrrolopyridine modulators of RORC2 and methods of use thereof US Patent  US9920054 Publication Date 3/20/2018 
Target
Name:
Nuclear receptor ROR-gamma
Synonyms:
NR1F3 Nuclear receptor ROR-gamma (RORC) RAR-related orphan receptor C (RORc) RORG RZRG Retinoid-related orphan receptor-gamma (RORc)
Type:
Enzyme Catalytic Domain
Mol. Mass.:
58218.40
Organism:
Homo sapiens (Human)
Description:
P51449
Residue:
518
  
Inhibitor
Name:
BDBM190304
Synonyms:
US10227346, Example 65 US9670201, 65 (R)-3-cyano-N-(3-(1-(cyclopentanecarbonyl)-2,2-dimethylpiperidin-4-yl)-1-methyl-4-(trifluoromethyl)-1H-pyrrolo[2,3-b]pyridin-5-yl)benzamide | US9920054, Example 65
Type:
Small organic molecule
Emp. Form.:
C30H32F3N5O2
Mol. Mass.:
551.6026
SMILES:
Cn1cc([C@@H]2CCN(C(=O)C3CCCC3)C(C)(C)C2)c2c(c(NC(=O)c3cccc(c3)C#N)cnc12)C(F)(F)F
: