Target
Nuclear receptor ROR-gamma
Ligand
BDBM190312
Substrate
IC50
5.60±n/a nM
Citation
 Schnute, ME Methyl- and trifluoromethyl-substituted pyrrolopyridine modulators of RORC2 and methods of use thereof US Patent  US9920054 Publication Date 3/20/2018 
Target
Name:
Nuclear receptor ROR-gamma
Synonyms:
NR1F3 Nuclear receptor ROR-gamma (RORC) RAR-related orphan receptor C (RORc) RORG RZRG Retinoid-related orphan receptor-gamma (RORc)
Type:
Enzyme Catalytic Domain
Mol. Mass.:
58218.40
Organism:
Homo sapiens (Human)
Description:
P51449
Residue:
518
  
Inhibitor
Name:
BDBM190312
Synonyms:
US10227346, Example 70 US9670201, 70 (R)-3-cyano-N-(3-(1-isobutyryl-2,2-dimethylpiperidin-4-yl)-1,4-dimethyl-1H-pyrrolo[2,3-b]pyridin-5-yl)-4-methoxybenzamide | US9920054, Example 70
Type:
Small organic molecule
Emp. Form.:
C29H35N5O3
Mol. Mass.:
501.6199
SMILES:
COc1ccc(cc1C#N)C(=O)Nc1cnc2n(C)cc([C@@H]3CCN(C(=O)C(C)C)C(C)(C)C3)c2c1C
: