Target
Phospholipase A2, membrane associated
Ligand
BDBM23757
Substrate
BDBM23751
Meas. Tech.
Fluorimetric Assay
pH
7.5±n/a
Temperature
295.15±n/a K
IC50
>100000±n/a nM
Citation
 Boukli, LTouaibia, MMeddad-Belhabich, NDjimdé, APark, CHKim, JJYoon, JHLamouri, AHeymans, F Design of new potent and selective secretory phospholipase A2 inhibitors. Part 5: synthesis and biological activity of 1-alkyl-4-[4,5-dihydro-1,2,4-[4H]-oxadiazol-5-one-3-ylmethylbenz-4'-yl(oyl)] piperazines. Bioorg Med Chem 16:1242-53 (2008)  
Target
Name:
Phospholipase A2, membrane associated
Synonyms:
GIIC sPLA2 NPS-PLA2 Non-pancreatic secretory phospholipase A2 (hnps-PLA2) PLA2B PLA2L Phospholipase A2 group IIA | RASF-A
Type:
Hydrolase
Mol. Mass.:
16101.20
Organism:
Homo sapiens (Human)
Description:
The human nps PLA2 was cloned, and expressed in E. coli. There was a refolding process in the purification.
Residue:
144
  
Inhibitor
Name:
BDBM23757
Synonyms:
3-{4-[(4-tetradecylpiperazin-1-yl)carbonyl]phenyl}-4,5-dihydro-1,2,4-oxadiazol-5-one | PMS 1062 piperazine deriv., 25a
Type:
Small organic molecule
Emp. Form.:
C27H42N4O3
Mol. Mass.:
470.6474
SMILES:
CCCCCCCCCCCCCCN1CCN(CC1)C(=O)c1ccc(cc1)-c1nc(=O)o[nH]1
:
Substrate
Name:
BDBM23751
Synonyms:
1-hexadecanoyl-2-(10-pyrenyldecanoyl)-sn-glycero-3-phosphoglycerol beta-pyC-10-PG
Type:
fluorescent phospholipid probe
Emp. Form.:
Mol. Mass.:
SMILES:
: