Target
Kinesin-like protein KIF11
Ligand
BDBM23830
Substrate
BDBM2
Meas. Tech.
Inhibition of Eg5 ATPase Activity
Temperature
298.15±n/a K
Ki
1000±n/a nM
Comments
extracted
Citation
 Debonis, SSkoufias, DAIndorato, RLLiger, FMarquet, BLaggner, CJoseph, BKozielski, F Structure-activity relationship of S-trityl-L-cysteine analogues as inhibitors of the human mitotic kinesin Eg5. J Med Chem 51:1115-25 (2008)  
Target
Name:
Kinesin-like protein KIF11
Synonyms:
EG5 KIF11_HUMAN Kinesin Spindle Protein Eg5 TRIP5 | kinesin spindle protein
Type:
PROTEIN
Mol. Mass.:
119138.97
Organism:
Homo sapiens (Human)
Description:
ChEMBL_1457426
Residue:
1056
  
Inhibitor
Name:
BDBM23830
Synonyms:
(2R)-2-amino-3-{[tris(4-methylphenyl)methyl]sulfanyl}propanoic acid | S-Trityl-L-Cysteine (STLC) Analogue, 59
Type:
Small organic molecule
Emp. Form.:
C25H27NO2S
Mol. Mass.:
405.552
SMILES:
Cc1ccc(cc1)C(SC[C@H](N)C(O)=O)(c1ccc(C)cc1)c1ccc(C)cc1
:
Substrate
Name:
BDBM2
Synonyms:
({[({[(2R,3S,4R,5R)-5-(6-amino-9H-purin-9-yl)-3,4-dihydroxyoxolan-2-yl]methoxy}(hydroxy)phosphoryl)oxy](hydroxy)phosphoryl}oxy)phosphonic acid Brimonidine ATP | CHEMBL14249
Type:
Nucleoside or nucleotide
Emp. Form.:
C10H16N5O13P3
Mol. Mass.:
507.181
SMILES:
Nc1ncnc2n(cnc12)[C@@H]1O[C@H](COP(O)(=O)OP(O)(=O)OP(O)(O)=O)[C@@H](O)[C@H]1O
: