Target
Serine/threonine-protein kinase TBK1
Ligand
BDBM276871
Substrate
Meas. Tech.
Biological Assay for TBK1 and IKKepsilon
IC50
1.46±n/a nM
Citation
 Du, ZGuerrero, JAKaplan, JAKnox, Jr., JENaduthambi, DPhillips, BWVenkataramani, CWang, PWatkins, WJZablocki, J Tank-binding kinase inhibitor compounds US Patent  US10259811 Publication Date 4/16/2019 
Target
Name:
Serine/threonine-protein kinase TBK1
Synonyms:
NAK Protein cereblon/Serine/threonine-protein kinase TBK1 TANK-binding kinase 1 (TBK-1) TBK1 | TBK1_HUMAN
Type:
protein
Mol. Mass.:
83645.20
Organism:
Homo sapiens (Human)
Description:
Q9UHD2
Residue:
729
  
Inhibitor
Name:
BDBM276871
Synonyms:
US10072001, Example 57 | US10259811, Example 57
Type:
Small organic molecule
Emp. Form.:
C32H30N6O3
Mol. Mass.:
546.619
SMILES:
O=C(CC#N)N1CCN(CC1)c1ccc(cc1)-c1cc2c(ccnc2[nH]1)-c1ccc(OC2CCOCC2)c(c1)C#N
: