Target
Inhibitor of nuclear factor kappa-B kinase subunit epsilon
Ligand
BDBM276965
Substrate
Meas. Tech.
Biological Assay for TBK1 and IKKepsilon
IC50
0.687±n/a nM
Citation
 Du, ZGuerrero, JAKaplan, JAKnox, Jr., JENaduthambi, DPhillips, BWVenkataramani, CWang, PWatkins, WJZablocki, J Tank-binding kinase inhibitor compounds US Patent  US10259811 Publication Date 4/16/2019 
Target
Name:
Inhibitor of nuclear factor kappa-B kinase subunit epsilon
Synonyms:
I kappa-B kinase epsilon I-kappa-B kinase epsilon (IKK-E) IKBKE IKK-epsilon IKKE IKKI KIAA0151 | von Hippel-Lindau disease tumor suppressor/Inhibitor of nuclear factor kappa-B kinase subunit epsilon
Type:
Serine/threonine-protein kinase
Mol. Mass.:
80475.98
Organism:
Homo sapiens (Human)
Description:
Kinase inhibitory activity was determined using recombinant human IKK-epsilon expressed in baculovirus as a FLAG-tagged fusion protein.
Residue:
716
  
Inhibitor
Name:
BDBM276965
Synonyms:
US10072001, Example 141 | US10259811, Example 141
Type:
Small organic molecule
Emp. Form.:
C34H35F2N7O5
Mol. Mass.:
659.6824
SMILES:
COc1cc(ccc1N1CCN(CC1)C1COC1)-c1cc2c(ncnc2[nH]1)-c1ccc(OC2CCN(CC2(F)F)C(=O)CO)c(c1)C#N
: