Target
Plasminogen
Ligand
BDBM23905
Substrate
BDBM23923
Meas. Tech.
Determination of Inhibition Constants
Ki
1000±n/a nM
Citation
 Steinmetzer, TSchweinitz, AStürzebecher, ADönnecke, DUhland, KSchuster, OSteinmetzer, PMüller, FFriedrich, RThan, MEBode, WStürzebecher, J Secondary amides of sulfonylated 3-amidinophenylalanine. New potent and selective inhibitors of matriptase. J Med Chem 49:4116-26 (2006)  
Target
Name:
Plasminogen
Synonyms:
Activation peptide PLG Plasmin Plasmin heavy chain A, short form | Plasmin light chain B
Type:
Enzyme
Mol. Mass.:
90579.18
Organism:
Homo sapiens (Human)
Description:
Residue:
810
  
Inhibitor
Name:
BDBM23905
Synonyms:
3-[(2S)-3-[4-(2-carbamimidamidoethyl)piperidin-1-yl]-3-oxo-2-{[2,4,6-tris(propan-2-yl)benzene]sulfonamido}propyl]benzene-1-carboximidamide | 3-amidinophenylalanine deriv., 48
Type:
Small organic molecule
Emp. Form.:
C33H51N7O3S
Mol. Mass.:
625.868
SMILES:
[#6]-[#6](-[#6])-c1cc(-[#6](-[#6])-[#6])c(c(c1)-[#6](-[#6])-[#6])S(=O)(=O)[#7]-[#6@@H](-[#6]-c1cccc(c1)-[#6](-[#7])=[#7])-[#6](=O)-[#7]-1-[#6]-[#6]-[#6](-[#6]-[#6]\[#7]=[#6](/[#7])-[#7])-[#6]-[#6]-1
:
Substrate
Name:
BDBM23923
Synonyms:
Tos-Gly-Pro-Lys-pNA | tosyl-glycyl-L-prolyl-L-lysine p-nitroanilide
Type:
Emp. Form.:
Mol. Mass.:
SMILES:
: