Target
Coagulation factor X
Ligand
BDBM23899
Substrate
BDBM23925
Meas. Tech.
Determination of Inhibition Constants
Ki
1100±n/a nM
Citation
 Steinmetzer, TSchweinitz, AStürzebecher, ADönnecke, DUhland, KSchuster, OSteinmetzer, PMüller, FFriedrich, RThan, MEBode, WStürzebecher, J Secondary amides of sulfonylated 3-amidinophenylalanine. New potent and selective inhibitors of matriptase. J Med Chem 49:4116-26 (2006)  
Target
Name:
Coagulation factor X
Synonyms:
Coagulation factor X FA10_BOVIN | Factor Xa (fXa)
Type:
PROTEIN
Mol. Mass.:
54498.45
Organism:
Bos taurus
Description:
ChEMBL_1364435
Residue:
492
  
Inhibitor
Name:
BDBM23899
Synonyms:
3-[(2S)-2-[(4-cyclohexylbenzene)sulfonamido]-3-oxo-3-[4-(piperazin-1-ylcarbonyl)piperidin-1-yl]propyl]benzene-1-carboximidamide | 3-amidinophenylalanine deriv., 43
Type:
Small organic molecule
Emp. Form.:
C32H44N6O4S
Mol. Mass.:
608.795
SMILES:
NC(=N)c1cccc(C[C@H](NS(=O)(=O)c2ccc(cc2)C2CCCCC2)C(=O)N2CCC(CC2)C(=O)N2CCNCC2)c1
:
Substrate
Name:
BDBM23925
Synonyms:
MeSO2-D-Nle-Gly-Arg-p-nitroanilide | MeSO2-D-Nle-Gly-Arg-pNA
Type:
Emp. Form.:
Mol. Mass.:
SMILES:
: