Target
ALK tyrosine kinase receptor
Ligand
BDBM377014
Substrate
Meas. Tech.
Enzyme Activity Inhibition IC50 Evaluation
IC50
3.30±n/a nM
Citation
 Zhang, NXu, ZWang, TWang, Y Condensed-ring pyrimidylamino derivative, preparation method therefor, and intermediate, pharmaceutical composition and applications thereof US Patent  US10259816 Publication Date 4/16/2019 
Target
Name:
ALK tyrosine kinase receptor
Synonyms:
ALK ALK_HUMAN CD_antigen: CD246
Type:
Protein
Mol. Mass.:
176453.10
Organism:
Homo sapiens (Human)
Description:
Q9UM73
Residue:
1620
  
Inhibitor
Name:
BDBM377014
Synonyms:
4-[7-({8-[2-Methoxy-4-trifluoromethylphenyl]quinazolin-2-yl}amino)-2,3-dihydro-1-benzofuran-4-yl]piperidin-4-ol US10611770, Compound 37
Type:
Small organic molecule
Emp. Form.:
C29H27F3N4O3
Mol. Mass.:
536.5449
SMILES:
COc1cc(ccc1-c1cccc2cnc(Nc3ccc(c4CCOc34)C3(O)CCNCC3)nc12)C(F)(F)F
: