Target
ALK tyrosine kinase receptor
Ligand
BDBM377015
Substrate
Meas. Tech.
Enzyme Activity Inhibition IC50 Evaluation
IC50
12.0±n/a nM
Citation
 Zhang, NXu, ZWang, TWang, Y Condensed-ring pyrimidylamino derivative, preparation method therefor, and intermediate, pharmaceutical composition and applications thereof US Patent  US10259816 Publication Date 4/16/2019 
Target
Name:
ALK tyrosine kinase receptor
Synonyms:
ALK ALK_HUMAN CD_antigen: CD246
Type:
Protein
Mol. Mass.:
176453.10
Organism:
Homo sapiens (Human)
Description:
Q9UM73
Residue:
1620
  
Inhibitor
Name:
BDBM377015
Synonyms:
7-{[8-(4-Fluoro-2-methoxyphenyl)quinazolin-2-yl]amino}-N-(piperidin-4-yl)-2,3-dihydro-1-benzofuran-4-carboxamide US10611770, Compound 40
Type:
Small organic molecule
Emp. Form.:
C29H28FN5O3
Mol. Mass.:
513.5627
SMILES:
COc1cc(F)ccc1-c1cccc2cnc(Nc3ccc(C(=O)NC4CCNCC4)c4CCOc34)nc12
: