Target
Phosphatidylinositol 4,5-bisphosphate 3-kinase catalytic subunit delta isoform
Ligand
BDBM377118
Substrate
Meas. Tech.
PI3Kdelta Scintillation Proximity Assay
IC50
<100±n/a nM
Citation
 Combs, APSparks, RBMaduskuie, Jr., TP Bicyclic azaheterocyclobenzylamines as PI3K inhibitors US Patent  US10259818 Publication Date 4/16/2019 
Target
Name:
Phosphatidylinositol 4,5-bisphosphate 3-kinase catalytic subunit delta isoform
Synonyms:
PI3-kinase p110 subunit delta PI3-kinase subunit p110-delta PIK3CD Phosphatidylinositol 4,5-biphosphate 3-kinase catalytic subunit delta (PIK3CD) Phosphatidylinositol 4,5-bisphosphate 3-kinase 110 kDa catalytic subunit delta (PI3K delta) Phosphatidylinositol 4,5-bisphosphate 3-kinase catalytic subunit delta (PI3Kdelta) Phosphatidylinositol 4,5-bisphosphate 3-kinase catalytic subunit delta isoform (PI3K delta) Phosphatidylinositol 4,5-bisphosphate 3-kinase catalytic subunit delta isoform (PI3K-delta) Phosphatidylinositol 4,5-bisphosphate 3-kinase catalytic subunit delta isoform (PI3Kdelta)
Type:
Enzyme Subunit
Mol. Mass.:
119489.41
Organism:
Homo sapiens (Human)
Description:
O00329
Residue:
1044
  
Inhibitor
Name:
BDBM377118
Synonyms:
US10259818, Example 100 ethyl 3-[9-[1-(4-amino-3- methyl-1H-pyrazolo[3,4- d]pyrimidin-1-yl)ethyl]-7- chloro-6-cyano-2-methyl- 2,3-dihydro-1,4- benzoxazepin-4(5H)- yl]azetidine-1-carboxylate
Type:
Small organic molecule
Emp. Form.:
C25H29ClN8O3
Mol. Mass.:
525.003
SMILES:
CCOC(=O)N1CC(C1)N1C[C@@H](C)Oc2c(cc(Cl)c(C#N)c2C1)C(C)n1nc(C)c2c(N)ncnc12
: