Target
Phosphatidylinositol 4,5-bisphosphate 3-kinase catalytic subunit delta isoform
Ligand
BDBM377129
Substrate
Meas. Tech.
PI3Kdelta Scintillation Proximity Assay
IC50
<100±n/a nM
Citation
 Combs, APSparks, RBMaduskuie, Jr., TP Bicyclic azaheterocyclobenzylamines as PI3K inhibitors US Patent  US10259818 Publication Date 4/16/2019 
Target
Name:
Phosphatidylinositol 4,5-bisphosphate 3-kinase catalytic subunit delta isoform
Synonyms:
PI3-kinase p110 subunit delta PI3-kinase subunit p110-delta PIK3CD Phosphatidylinositol 4,5-biphosphate 3-kinase catalytic subunit delta (PIK3CD) Phosphatidylinositol 4,5-bisphosphate 3-kinase 110 kDa catalytic subunit delta (PI3K delta) Phosphatidylinositol 4,5-bisphosphate 3-kinase catalytic subunit delta (PI3Kdelta) Phosphatidylinositol 4,5-bisphosphate 3-kinase catalytic subunit delta isoform (PI3K delta) Phosphatidylinositol 4,5-bisphosphate 3-kinase catalytic subunit delta isoform (PI3K-delta) Phosphatidylinositol 4,5-bisphosphate 3-kinase catalytic subunit delta isoform (PI3Kdelta)
Type:
Enzyme Subunit
Mol. Mass.:
119489.41
Organism:
Homo sapiens (Human)
Description:
O00329
Residue:
1044
  
Inhibitor
Name:
BDBM377129
Synonyms:
9-[1-(4-amino-3-methyl- 1H-pyrazolo[3,4- d]pyrimidin-1-yl)ethyl]-7- chloro-4-(2-methoxyethyl)-2-methyl-2,3,4,5-tetrahydro-1,4-benzoxazepine-6-carbonitrile US9944646, Example 111
Type:
Small organic molecule
Emp. Form.:
C22H26ClN7O2
Mol. Mass.:
455.941
SMILES:
COCCN1C[C@H](C)Oc2c(cc(Cl)c(C#N)c2C1)C(C)n1nc(C)c2c(N)ncnc12
: