Target
ALK tyrosine kinase receptor [L1196M]
Ligand
BDBM261631
Substrate
Meas. Tech.
ELISA-Based in vitro Kinase Assay
pH
7.5±n/a
Temperature
298.15±n/a K
IC50
5800±n/a nM
Comments
extracted
Citation
 Gambacorti-Passerini, CMologni, LScapozza, LBisson, WGoekjian, PD Attoma, J 2-acylaminothiazoles for the treatment of cancer US Patent  US9708279 Publication Date 7/18/2017 
Target
Name:
ALK tyrosine kinase receptor [L1196M]
Synonyms:
ALK ALK tyrosine kinase receptor (ALK) (L1196M) ALK tyrosine kinase receptor (L1196M) Anaplastic lymphoma kinase L1196M (ALK L1196M) | Tyrosine-protein kinase receptor [L1196M]
Type:
Mol. Mass.:
176471.13
Organism:
Homo sapiens (Human)
Description:
Q9UM73[L1196M]
Residue:
1620
  
Inhibitor
Name:
BDBM261631
Synonyms:
N-(4-(3-((2-methoxyphenyl)ethynyl)-4-methylphenyl)thiazol-2-yl)-4-((4-methylpiperazin-1-yl)methyl)benzamide | US9708279, 8
Type:
Small organic molecule
Emp. Form.:
C32H32N4O2S
Mol. Mass.:
536.687
SMILES:
COc1ccccc1C#Cc1cc(ccc1C)-c1csc(NC(=O)c2ccc(CN3CCN(C)CC3)cc2)n1
: