Target
ALK tyrosine kinase receptor [L1196M]
Ligand
BDBM261655
Substrate
Meas. Tech.
ELISA-Based in vitro Kinase Assay
pH
7.5±n/a
Temperature
298.15±n/a K
IC50
11000±n/a nM
Comments
extracted
Citation
 Gambacorti-Passerini, CMologni, LScapozza, LBisson, WGoekjian, PD Attoma, J 2-acylaminothiazoles for the treatment of cancer US Patent  US9708279 Publication Date 7/18/2017 
Target
Name:
ALK tyrosine kinase receptor [L1196M]
Synonyms:
ALK ALK tyrosine kinase receptor (ALK) (L1196M) ALK tyrosine kinase receptor (L1196M) Anaplastic lymphoma kinase L1196M (ALK L1196M) | Tyrosine-protein kinase receptor [L1196M]
Type:
Mol. Mass.:
176471.13
Organism:
Homo sapiens (Human)
Description:
Q9UM73[L1196M]
Residue:
1620
  
Inhibitor
Name:
BDBM261655
Synonyms:
N-(4-(3-((4-fluorophenyl)ethynyl)phenyl)thiazol-2-yl)-4-((4-methylpiperazin-1-yl)methyl)benzamide | US9708279, 32
Type:
Small organic molecule
Emp. Form.:
C30H27FN4OS
Mol. Mass.:
510.625
SMILES:
CN1CCN(Cc2ccc(cc2)C(=O)Nc2nc(cs2)-c2cccc(c2)C#Cc2ccc(F)cc2)CC1
: