Target
ALK tyrosine kinase receptor
Ligand
BDBM261656
Substrate
Meas. Tech.
ELISA-Based in vitro Kinase Assay
pH
7.5±n/a
Temperature
298.15±n/a K
IC50
4100±n/a nM
Comments
extracted
Citation
 Gambacorti-Passerini, CMologni, LScapozza, LBisson, WGoekjian, PD Attoma, J 2-acylaminothiazoles for the treatment of cancer US Patent  US9708279 Publication Date 7/18/2017 
Target
Name:
ALK tyrosine kinase receptor
Synonyms:
ALK ALK_HUMAN CD_antigen: CD246
Type:
Protein
Mol. Mass.:
176453.10
Organism:
Homo sapiens (Human)
Description:
Q9UM73
Residue:
1620
  
Inhibitor
Name:
BDBM261656
Synonyms:
N-(4-(3-((3,5-bis(trifluoromethyl)phenyl)ethynyl)phenyl)thiazol-2-yl)-4-((4-methylpiperazin-1-yl)methyl)benzamide | US9708279, 33
Type:
Small organic molecule
Emp. Form.:
C32H26F6N4OS
Mol. Mass.:
628.63
SMILES:
CN1CCN(Cc2ccc(cc2)C(=O)Nc2nc(cs2)-c2cccc(c2)C#Cc2cc(cc(c2)C(F)(F)F)C(F)(F)F)CC1
: