Target
ALK tyrosine kinase receptor [L1196M]
Ligand
BDBM261660
Substrate
Meas. Tech.
ELISA-Based in vitro Kinase Assay
pH
7.5±n/a
Temperature
298.15±n/a K
IC50
2100±n/a nM
Comments
extracted
Citation
 Gambacorti-Passerini, CMologni, LScapozza, LBisson, WGoekjian, PD Attoma, J 2-acylaminothiazoles for the treatment of cancer US Patent  US9708279 Publication Date 7/18/2017 
Target
Name:
ALK tyrosine kinase receptor [L1196M]
Synonyms:
ALK ALK tyrosine kinase receptor (ALK) (L1196M) ALK tyrosine kinase receptor (L1196M) Anaplastic lymphoma kinase L1196M (ALK L1196M) | Tyrosine-protein kinase receptor [L1196M]
Type:
Mol. Mass.:
176471.13
Organism:
Homo sapiens (Human)
Description:
Q9UM73[L1196M]
Residue:
1620
  
Inhibitor
Name:
BDBM261660
Synonyms:
N-(4-(4-((tert-butyldimethylsilyl)ethynyl)phenyl)thiazol-2-yl)-4-((4-methylpiperazin-1-yl)methyl)benzamide | US9708279, 37
Type:
Small organic molecule
Emp. Form.:
C30H38N4OSSi
Mol. Mass.:
530.799
SMILES:
CN1CCN(Cc2ccc(cc2)C(=O)Nc2nc(cs2)-c2ccc(cc2)C#C[Si](C)(C)C(C)(C)C)CC1
: