Target
ALK tyrosine kinase receptor [L1196M]
Ligand
BDBM261664
Substrate
Meas. Tech.
ELISA-Based in vitro Kinase Assay
pH
7.5±n/a
Temperature
298.15±n/a K
IC50
2700±n/a nM
Comments
extracted
Citation
 Gambacorti-Passerini, CMologni, LScapozza, LBisson, WGoekjian, PD Attoma, J 2-acylaminothiazoles for the treatment of cancer US Patent  US9708279 Publication Date 7/18/2017 
Target
Name:
ALK tyrosine kinase receptor [L1196M]
Synonyms:
ALK ALK tyrosine kinase receptor (ALK) (L1196M) ALK tyrosine kinase receptor (L1196M) Anaplastic lymphoma kinase L1196M (ALK L1196M) | Tyrosine-protein kinase receptor [L1196M]
Type:
Mol. Mass.:
176471.13
Organism:
Homo sapiens (Human)
Description:
Q9UM73[L1196M]
Residue:
1620
  
Inhibitor
Name:
BDBM261664
Synonyms:
N-(4-(3-((tert-butyldiphenylsilyl)ethynyl)phenyl)thiazol-2-yl)-4-(morpholinomethyl)benzamide | US9708279, 41
Type:
Small organic molecule
Emp. Form.:
C39H39N3O2SSi
Mol. Mass.:
641.896
SMILES:
CC(C)(C)[Si](C#Cc1cccc(c1)-c1csc(NC(=O)c2ccc(CN3CCOCC3)cc2)n1)(c1ccccc1)c1ccccc1
: