Target
Serine/threonine-protein kinase pim-2
Ligand
BDBM377197
Substrate
Meas. Tech.
Pim Enzyme Assays
IC50
<100±n/a nM
Citation
 Xue, CFeng, HLi, YZhang, K Thiazolecarboxamides and pyridinecarboxamide compounds useful as Pim kinase inhibitors US Patent  US10265307 Publication Date 4/23/2019 
Target
Name:
Serine/threonine-protein kinase pim-2
Synonyms:
PIM2 Pim-2h Serine/threonine-protein kinase PIM | Serine/threonine-protein kinase pim-2 (PIM2)
Type:
Serine/threonine-protein kinase
Mol. Mass.:
34185.93
Organism:
Homo sapiens (Human)
Description:
Q9P1W9
Residue:
311
  
Inhibitor
Name:
BDBM377197
Synonyms:
N-{4-[(3S,5R)-3-Amino-5-methylpiperidin-1-yl]-7-hydroxy-6,7-dihydro-5H-cyclopenta[b]pyridin-3-yl}-6-(2,6-difluorophenyl)-5-fluoropyridine-2-carboxamide US10517858, Example 45 (Diastereoisomer 1) US11229631, Example 45 Diastereoisomer 1
Type:
Small organic molecule
Emp. Form.:
C26H26F3N5O2
Mol. Mass.:
497.5121
SMILES:
C[C@@H]1C[C@H](N)CN(C1)c1c2CC[C@H](O)c2ncc1NC(=O)c1ccc(F)c(n1)-c1c(F)cccc1F
: