Target
Serine/threonine-protein kinase pim-2
Ligand
BDBM377218
Substrate
Meas. Tech.
Pim Enzyme Assays
IC50
<100±n/a nM
Citation
 Xue, CFeng, HLi, YZhang, K Thiazolecarboxamides and pyridinecarboxamide compounds useful as Pim kinase inhibitors US Patent  US10265307 Publication Date 4/23/2019 
Target
Name:
Serine/threonine-protein kinase pim-2
Synonyms:
PIM2 Pim-2h Serine/threonine-protein kinase PIM | Serine/threonine-protein kinase pim-2 (PIM2)
Type:
Serine/threonine-protein kinase
Mol. Mass.:
34185.93
Organism:
Homo sapiens (Human)
Description:
Q9P1W9
Residue:
311
  
Inhibitor
Name:
BDBM377218
Synonyms:
US10265307, Example 56-2 US10828290, Example 56 (Diastereoisomer 2) | US11229631, Example 56 Diastereoisomer 2
Type:
Small organic molecule
Emp. Form.:
C27H28F3N5O3
Mol. Mass.:
527.5381
SMILES:
COc1ccc(F)c(c1F)-c1nc(ccc1F)C(=O)Nc1cnc2[C@H](O)CCc2c1N1C[C@H](C)C[C@H](N)C1
: