Target
fMet-Leu-Phe receptor
Ligand
BDBM377267
Substrate
Meas. Tech.
Measuring Agonistic Activity of Compounds in hFPR1-Gα15-CHO and hFPR2-Aq-CHO Cell
EC50
<1±n/a nM
Citation
 Jakob, FNordhoff, SRider, DWagener, MBahrenberg, GDunkern, T 6-membered cyclic amines or lactames substituted with urea and phenyl US Patent  US10265310 Publication Date 4/23/2019 
Target
Name:
fMet-Leu-Phe receptor
Synonyms:
FPR FPR1_HUMAN N-formyl peptide receptor 1 fMLP receptor formyl peptide receptor 1
Type:
Enzyme Catalytic Domain
Mol. Mass.:
38456.14
Organism:
Homo sapiens (Human)
Description:
gi_4503779
Residue:
350
  
Inhibitor
Name:
BDBM377267
Synonyms:
US10265310, Example 13 | rac-trans-1-(4-chlorophenyl)-3-(1-(2-hydroxyacetyl)-4-(4-methoxyphenyl)piperidin-3-yl)urea
Type:
Small organic molecule
Emp. Form.:
C21H24ClN3O4
Mol. Mass.:
417.886
SMILES:
COc1ccc(cc1)[C@H]1CCN(C[C@@H]1NC(=O)Nc1ccc(Cl)cc1)C(=O)CO
: