Target
fMet-Leu-Phe receptor
Ligand
BDBM377292
Substrate
Meas. Tech.
Measuring Agonistic Activity of Compounds in hFPR1-Gα15-CHO and hFPR2-Aq-CHO Cell
EC50
500±n/a nM
Citation
 Jakob, FNordhoff, SRider, DWagener, MBahrenberg, GDunkern, T 6-membered cyclic amines or lactames substituted with urea and phenyl US Patent  US10265310 Publication Date 4/23/2019 
Target
Name:
fMet-Leu-Phe receptor
Synonyms:
FPR FPR1_HUMAN N-formyl peptide receptor 1 fMLP receptor formyl peptide receptor 1
Type:
Enzyme Catalytic Domain
Mol. Mass.:
38456.14
Organism:
Homo sapiens (Human)
Description:
gi_4503779
Residue:
350
  
Inhibitor
Name:
BDBM377292
Synonyms:
US10265310, Example 45 | ent1-1-(4-chlorophenyl)-3-(4-(2-fluoro-4-methoxyphenyl)piperidin-3-yl)urea
Type:
Small organic molecule
Emp. Form.:
C19H21ClFN3O2
Mol. Mass.:
377.84
SMILES:
COc1ccc([C@H]2CCNC[C@@H]2NC(=O)Nc2ccc(Cl)cc2)c(F)c1
: