Target
N-formyl peptide receptor 2
Ligand
BDBM377314
Substrate
Meas. Tech.
Measuring Agonistic Activity of Compounds in hFPR1-Gα15-CHO and hFPR2-Aq-CHO Cell
EC50
500±n/a nM
Citation
 Jakob, FNordhoff, SRider, DWagener, MBahrenberg, GDunkern, T 6-membered cyclic amines or lactames substituted with urea and phenyl US Patent  US10265310 Publication Date 4/23/2019 
Target
Name:
N-formyl peptide receptor 2
Synonyms:
ALXR, FPRL1, FPR2 FPR2 FPRH1 Formyl Peptide Receptor-Like 1 LXA4 receptor Lipoxin A4 receptor RFP | hFPRL
Type:
G Protein-Coupled Receptor (GPCR)
Mol. Mass.:
38968.35
Organism:
Homo sapiens (Human)
Description:
P25090
Residue:
351
  
Inhibitor
Name:
BDBM377314
Synonyms:
US10265310, Example 67 | US10265310, Example 68
Type:
Small organic molecule
Emp. Form.:
C18H16ClF2N3O2
Mol. Mass.:
379.788
SMILES:
Fc1ccc(C2CC(=O)NCC2NC(=O)Nc2ccc(Cl)cc2)c(F)c1
: