Target
Tyrosine-protein kinase BTK
Ligand
BDBM377365
Substrate
Meas. Tech.
Human Recombinant Btk Enzyme Assay
IC50
0.046±n/a nM
Citation
 Ahmad, SBatt, DGLiu, QMacor, JETino, JAWatterson, SHNair, SKMaishal, TK Carbazole derivatives US Patent  US10266491 Publication Date 4/23/2019 
Target
Name:
Tyrosine-protein kinase BTK
Synonyms:
AGMX1 Agammaglobulinaemia tyrosine kinase B cell progenitor kinase BPK BTK_HUMAN Tyrosine Kinase BTK Tyrosine-protein kinase BTK (BTK)
Type:
Enzyme
Mol. Mass.:
76289.95
Organism:
Homo sapiens (Human)
Description:
Q06187
Residue:
659
  
Inhibitor
Name:
BDBM377365
Synonyms:
US10266491, Example 33 US11053197, Example 33
Type:
Small organic molecule
Emp. Form.:
C24H23N3O4S
Mol. Mass.:
449.522
SMILES:
CC(C)(O)c1ccc2c(c1)[nH]c1c(ccc(-c3cccc(NS(=O)(=O)C=C)c3)c21)C(N)=O
: