Target
Tyrosine-protein kinase BTK
Ligand
BDBM377487
Substrate
Meas. Tech.
Human Recombinant Btk Enzyme Assay
IC50
0.100±n/a nM
Citation
 Ahmad, SBatt, DGLiu, QMacor, JETino, JAWatterson, SHNair, SKMaishal, TK Carbazole derivatives US Patent  US10266491 Publication Date 4/23/2019 
Target
Name:
Tyrosine-protein kinase BTK
Synonyms:
AGMX1 Agammaglobulinaemia tyrosine kinase B cell progenitor kinase BPK BTK_HUMAN Tyrosine Kinase BTK Tyrosine-protein kinase BTK (BTK)
Type:
Enzyme
Mol. Mass.:
76289.95
Organism:
Homo sapiens (Human)
Description:
Q06187
Residue:
659
  
Inhibitor
Name:
BDBM377487
Synonyms:
4-(1-acryloylindolin-6-yl)-3- fluoro-7-(2-hydroxyethyl)- 9H-carbazole-1- carboxamide US10676434, Example 180 | US11053197, Example 180
Type:
Small organic molecule
Emp. Form.:
C26H22FN3O3
Mol. Mass.:
443.4696
SMILES:
NC(=O)c1cc(F)c(-c2ccc3CCN(C(=O)C=C)c3c2)c2c3ccc(CCO)cc3[nH]c12
: