Target
Solute carrier family 22 member 12
Ligand
BDBM377516
Substrate
Meas. Tech.
URAT1-Model Assay
EC50
275±n/a nM
Citation
 Ouk, SGunic, EVernier, JChen, C Thioacetate compounds, compositions and methods of use US Patent  US10266493 Publication Date 4/23/2019 
Target
Name:
Solute carrier family 22 member 12
Synonyms:
OATL4 RST S22AC_HUMAN Solute carrier family 22 member 12 URAT1 Urate anion exchanger 1 (URAT1) | Uric Acid Transporter 1 (URAT1)
Type:
Enzyme
Mol. Mass.:
59638.65
Organism:
Homo sapiens (Human)
Description:
Q96S37
Residue:
553
  
Inhibitor
Name:
BDBM377516
Synonyms:
US10266493, Example 1A | US10919858, Example 1A
Type:
Small organic molecule
Emp. Form.:
C16H14N2O2S
Mol. Mass.:
298.36
SMILES:
CC(C)(Sc1cccnc1-c1ccc(cc1)C#N)C(O)=O
: