Target
Solute carrier family 22 member 12
Ligand
BDBM377530
Substrate
Meas. Tech.
URAT1-Model Assay
EC50
26±n/a nM
Citation
 Ouk, SGunic, EVernier, JChen, C Thioacetate compounds, compositions and methods of use US Patent  US10266493 Publication Date 4/23/2019 
Target
Name:
Solute carrier family 22 member 12
Synonyms:
OATL4 RST S22AC_HUMAN Solute carrier family 22 member 12 URAT1 Urate anion exchanger 1 (URAT1) | Uric Acid Transporter 1 (URAT1)
Type:
Enzyme
Mol. Mass.:
59638.65
Organism:
Homo sapiens (Human)
Description:
Q96S37
Residue:
553
  
Inhibitor
Name:
BDBM377530
Synonyms:
US10266493, Example 2O US10919858, Example 2P
Type:
Small organic molecule
Emp. Form.:
C15H14ClNO2S
Mol. Mass.:
307.795
SMILES:
CC(C)(Sc1ccncc1-c1ccc(Cl)cc1)C(O)=O
: