Target
Isocitrate dehydrogenase [NADP] cytoplasmic [R132H]
Ligand
BDBM377630
Substrate
Meas. Tech.
IDH1-R132H and IDH1-R132C Enzymatic Assay
IC50
>1000±n/a nM
Citation
 Yang, XHuang, CMa, FZhang, JWang, XZhang, Y Carboxy substituted (hetero) aromatic ring derivatives and preparation method and uses thereof US Patent  US10266496 Publication Date 4/23/2019 
Target
Name:
Isocitrate dehydrogenase [NADP] cytoplasmic [R132H]
Synonyms:
Cytosolic NADP-isocitrate dehydrogenase (IDH1)(R132H) IDH1 R132H IDHC_HUMAN Isocitrate dehydrogenase 1 mutant (R132H) Isocitrate dehydrogenase [NADP] cytoplasmic (IDH1)(R132H) PICD
Type:
Protein
Mol. Mass.:
46641.74
Organism:
Homo sapiens (Human)
Description:
Human IDH1 R132H (SEQ ID No. 2 in patent). First three are removed. Google patent parsed wrong.
Residue:
414
  
Inhibitor
Name:
BDBM377630
Synonyms:
4-{[(6-chloro-2-oxo-1,2-dihydroquinolin-3- | US10266495, Compound I-42
Type:
Small organic molecule
Emp. Form.:
C18H16ClN3O2
Mol. Mass.:
341.792
SMILES:
CNC(=O)c1ccc(NCc2cc3cc(Cl)ccc3[nH]c2=O)cc1
: