Target
Isocitrate dehydrogenase [NADP] cytoplasmic [R132C]
Ligand
BDBM377655
Substrate
Meas. Tech.
IDH1-R132H and IDH1-R132C Enzymatic Assay
IC50
>1000±n/a nM
Citation
 Yang, XHuang, CMa, FZhang, JWang, XZhang, Y Carboxy substituted (hetero) aromatic ring derivatives and preparation method and uses thereof US Patent  US10266496 Publication Date 4/23/2019 
Target
Name:
Isocitrate dehydrogenase [NADP] cytoplasmic [R132C]
Synonyms:
IDH1 IDH1(R132C) Isocitrate dehydrogenase (IDH1)(R132C) Isocitrate dehydrogenase [NADP] cytoplasmic (IDH1) (R132C) | PICD
Type:
Enzyme Catalytic Domain
Mol. Mass.:
46607.23
Organism:
Homo sapiens (Human)
Description:
O75874[R132C]
Residue:
414
  
Inhibitor
Name:
BDBM377655
Synonyms:
2-[(6-chloro-3-{[(4-cyano-3- | US10266495, Compound I-67
Type:
Small organic molecule
Emp. Form.:
C22H21ClN4O4
Mol. Mass.:
440.88
SMILES:
COc1cc(NCc2cc3cc(Cl)c(OCC(=O)N(C)C)cc3[nH]c2=O)ccc1C#N
: