Target
Isocitrate dehydrogenase [NADP] cytoplasmic [R132C]
Ligand
BDBM377657
Substrate
Meas. Tech.
IDH1-R132H and IDH1-R132C Enzymatic Assay
IC50
>1000±n/a nM
Citation
 Yang, XHuang, CMa, FZhang, JWang, XZhang, Y Carboxy substituted (hetero) aromatic ring derivatives and preparation method and uses thereof US Patent  US10266496 Publication Date 4/23/2019 
Target
Name:
Isocitrate dehydrogenase [NADP] cytoplasmic [R132C]
Synonyms:
IDH1 IDH1(R132C) Isocitrate dehydrogenase (IDH1)(R132C) Isocitrate dehydrogenase [NADP] cytoplasmic (IDH1) (R132C) | PICD
Type:
Enzyme Catalytic Domain
Mol. Mass.:
46607.23
Organism:
Homo sapiens (Human)
Description:
O75874[R132C]
Residue:
414
  
Inhibitor
Name:
BDBM377657
Synonyms:
4-[({6-chloro-7-[2-(morpholin-4-yl)-2-oxoethoxy]-2- | US10266495, Compound I-69
Type:
Small organic molecule
Emp. Form.:
C24H23ClN4O5
Mol. Mass.:
482.916
SMILES:
COc1cc(NCc2cc3cc(Cl)c(OCC(=O)N4CCOCC4)cc3[nH]c2=O)ccc1C#N
: