Target
Isocitrate dehydrogenase [NADP] cytoplasmic [R132C]
Ligand
BDBM377669
Substrate
Meas. Tech.
IDH1-R132H and IDH1-R132C Enzymatic Assay
IC50
>1000±n/a nM
Citation
 Yang, XHuang, CMa, FZhang, JWang, XZhang, Y Carboxy substituted (hetero) aromatic ring derivatives and preparation method and uses thereof US Patent  US10266496 Publication Date 4/23/2019 
Target
Name:
Isocitrate dehydrogenase [NADP] cytoplasmic [R132C]
Synonyms:
IDH1 IDH1(R132C) Isocitrate dehydrogenase (IDH1)(R132C) Isocitrate dehydrogenase [NADP] cytoplasmic (IDH1) (R132C) | PICD
Type:
Enzyme Catalytic Domain
Mol. Mass.:
46607.23
Organism:
Homo sapiens (Human)
Description:
O75874[R132C]
Residue:
414
  
Inhibitor
Name:
BDBM377669
Synonyms:
4-[({6-chloro-2-oxo-7-[2-(pyridin-4-yl)ethoxy]-1,2- | US10266495, Compound I-81
Type:
Small organic molecule
Emp. Form.:
C25H21ClN4O3
Mol. Mass.:
460.912
SMILES:
COc1cc(NCc2cc3cc(Cl)c(OCCc4ccncc4)cc3[nH]c2=O)ccc1C#N
: