Target
Isocitrate dehydrogenase [NADP] cytoplasmic [R132H]
Ligand
BDBM377686
Substrate
Meas. Tech.
IDH1-R132H and IDH1-R132C Enzymatic Assay
IC50
55±n/a nM
Citation
 Yang, XHuang, CMa, FZhang, JWang, XZhang, Y Carboxy substituted (hetero) aromatic ring derivatives and preparation method and uses thereof US Patent  US10266496 Publication Date 4/23/2019 
Target
Name:
Isocitrate dehydrogenase [NADP] cytoplasmic [R132H]
Synonyms:
Cytosolic NADP-isocitrate dehydrogenase (IDH1)(R132H) IDH1 R132H IDHC_HUMAN Isocitrate dehydrogenase 1 mutant (R132H) Isocitrate dehydrogenase [NADP] cytoplasmic (IDH1)(R132H) PICD
Type:
Protein
Mol. Mass.:
46641.74
Organism:
Homo sapiens (Human)
Description:
Human IDH1 R132H (SEQ ID No. 2 in patent). First three are removed. Google patent parsed wrong.
Residue:
414
  
Inhibitor
Name:
BDBM377686
Synonyms:
4-({[6-chloro-2-oxo-8- | US10266495, Compound I-98
Type:
Small organic molecule
Emp. Form.:
C24H19ClN4O3
Mol. Mass.:
446.886
SMILES:
COc1cc(NCc2cc3cc(Cl)cc(OCc4ccccn4)c3[nH]c2=O)ccc1C#N
: