Target
Aryl hydrocarbon receptor
Ligand
BDBM23930
Substrate
BDBM23927
Meas. Tech.
In Vitro Binding Assay
pH
7.6±n/a
Temperature
277.15±n/a K
Ki
9.2±1.7 nM
Comments
Antagonist.
Citation
 de Medina, PCasper, RSavouret, JFPoirot, M Synthesis and biological properties of new stilbene derivatives of resveratrol as new selective aryl hydrocarbon modulators. J Med Chem 48:287-91 (2005)  
Target
Name:
Aryl hydrocarbon receptor
Synonyms:
AHR Aryl Hydrocarbon Receptor (AhR) | Dioxin receptor
Type:
Transcription factor
Mol. Mass.:
94428.00
Organism:
Oryctolagus cuniculus (rabbit)
Description:
Cytosols from rabbit liver were used in binding assay.
Residue:
847
  
Inhibitor
Name:
BDBM23930
Synonyms:
1,3-difluoro-5-[(E)-2-(4-methoxyphenyl)ethenyl]benzene | trans-Stilbene Derivative, 4c
Type:
Small organic molecule
Emp. Form.:
C15H12F2O
Mol. Mass.:
246.252
SMILES:
COc1ccc(\C=C\c2cc(F)cc(F)c2)cc1
:
Substrate
Name:
BDBM23927
Synonyms:
2,3,7,8-Tetrachlorodibenzo-p-dioxin Tetrachlorodibenzodioxin | [3H]-TCDD
Type:
radiolabeled ligand
Emp. Form.:
C12H4Cl4O2
Mol. Mass.:
321.971
SMILES:
Clc1cc2Oc3cc(Cl)c(Cl)cc3Oc2cc1Cl
: