Target
Estrogen receptor
Ligand
BDBM23948
Substrate
[3H]-estradiol
Meas. Tech.
In Vitro Binding Assay
Ki
>100000±n/a nM
Citation
 de Medina, PCasper, RSavouret, JFPoirot, M Synthesis and biological properties of new stilbene derivatives of resveratrol as new selective aryl hydrocarbon modulators. J Med Chem 48:287-91 (2005)  
Target
Name:
Estrogen receptor
Synonyms:
ER ESR ESR1_HUMAN Estrogen receptor Estrogen receptor (ER-alpha) Estrogen receptor alpha (ER) Nuclear receptor subfamily 3 group A member 1
Type:
Protein
Mol. Mass.:
66230.44
Organism:
Homo sapiens (Human)
Description:
P03372
Residue:
595
  
Inhibitor
Name:
BDBM23948
Synonyms:
1,3-dichloro-5-[(Z)-2-[4-(trifluoromethyl)phenyl]ethenyl]benzene | cis-Stilbene Derivative, 5i
Type:
Small organic molecule
Emp. Form.:
C15H9Cl2F3
Mol. Mass.:
317.133
SMILES:
FC(F)(F)c1ccc(\C=C/c2cc(Cl)cc(Cl)c2)cc1
:
Substrate
Name:
BDBM17292
Synonyms:
(1S,10R,11S,14S,15S)-15-methyltetracyclo[8.7.0.0^{2,7}.0^{11,15}]heptadeca-2,4,6-triene-5,14-diol 17α-ethinylestradiol CHEMBL135 ESTRADIOL Ovocyclin US9040509, E2 US9561238, E2 [2,4,6,7-3H]-E2 [3H]]estradiol
Type:
Steroid
Emp. Form.:
C18H24O2
Mol. Mass.:
272.382
SMILES:
[H][C@@]12CC[C@H](O)[C@@]1(C)CC[C@]1([H])c3ccc(O)cc3CC[C@@]21[H]
: