Target
Tyrosine-protein kinase BTK
Ligand
BDBM377719
Substrate
Meas. Tech.
Human BTK LanthaScreen Assay
IC50
2.60±n/a nM
Citation
 Springer, JRDevadas, BGarland, DJGrapperhaus, MLHan, SHockerman, SLHughes, ROSaiah, ESchnute, MESelness, SRWalker, DPWan, ZXing, LZapf, CWSchmidt, MA Bruton's tyrosine kinase inhibitors US Patent  US10266513 Publication Date 4/23/2019 
Target
Name:
Tyrosine-protein kinase BTK
Synonyms:
AGMX1 Agammaglobulinaemia tyrosine kinase B cell progenitor kinase BPK BTK_HUMAN Tyrosine Kinase BTK Tyrosine-protein kinase BTK (BTK)
Type:
Enzyme
Mol. Mass.:
76289.95
Organism:
Homo sapiens (Human)
Description:
Q06187
Residue:
659
  
Inhibitor
Name:
BDBM377719
Synonyms:
5-amino-3-[4-(4-chlorophenoxy)phenyl]-1-(1-cyanopiperidin-3-yl)-1H-pyrazole-4-carboxamide US10266513, Example 14 US10815213, Example 13
Type:
Small organic molecule
Emp. Form.:
C22H21ClN6O2
Mol. Mass.:
436.894
SMILES:
NC(=O)c1c(N)n(nc1-c1ccc(Oc2ccc(Cl)cc2)cc1)C1CCCN(C1)C#N
: