Target
Tyrosine-protein kinase BTK
Ligand
BDBM377802
Substrate
Meas. Tech.
Human BTK LanthaScreen Assay
IC50
21.9±n/a nM
Citation
 Springer, JRDevadas, BGarland, DJGrapperhaus, MLHan, SHockerman, SLHughes, ROSaiah, ESchnute, MESelness, SRWalker, DPWan, ZXing, LZapf, CWSchmidt, MA Bruton's tyrosine kinase inhibitors US Patent  US10266513 Publication Date 4/23/2019 
Target
Name:
Tyrosine-protein kinase BTK
Synonyms:
AGMX1 Agammaglobulinaemia tyrosine kinase B cell progenitor kinase BPK BTK_HUMAN Tyrosine Kinase BTK Tyrosine-protein kinase BTK (BTK)
Type:
Enzyme
Mol. Mass.:
76289.95
Organism:
Homo sapiens (Human)
Description:
Q06187
Residue:
659
  
Inhibitor
Name:
BDBM377802
Synonyms:
5-amino-1-(1-cyanopiperidin-3-yl)- 3-[3-(3-fluoro-4- methylphenoxy)phenyl]-1H- pyrazole-4-carboxamide US10815213, Example 96
Type:
Small organic molecule
Emp. Form.:
C23H23FN6O2
Mol. Mass.:
434.4661
SMILES:
Cc1ccc(Oc2cccc(c2)-c2nn(C3CCCN(C3)C#N)c(N)c2C(N)=O)cc1F
: