Target
Tyrosine-protein kinase BTK
Ligand
BDBM377846
Substrate
Meas. Tech.
Human BTK LanthaScreen Assay
IC50
3.70±n/a nM
Citation
 Springer, JRDevadas, BGarland, DJGrapperhaus, MLHan, SHockerman, SLHughes, ROSaiah, ESchnute, MESelness, SRWalker, DPWan, ZXing, LZapf, CWSchmidt, MA Bruton's tyrosine kinase inhibitors US Patent  US10266513 Publication Date 4/23/2019 
Target
Name:
Tyrosine-protein kinase BTK
Synonyms:
AGMX1 Agammaglobulinaemia tyrosine kinase B cell progenitor kinase BPK BTK_HUMAN Tyrosine Kinase BTK Tyrosine-protein kinase BTK (BTK)
Type:
Enzyme
Mol. Mass.:
76289.95
Organism:
Homo sapiens (Human)
Description:
Q06187
Residue:
659
  
Inhibitor
Name:
BDBM377846
Synonyms:
5-amino-3-[4-(2,4-difluorophenoxy)phenyl]-1-{(3R)-1-[(2E)-4-(dimethylamino)but-2-enoyl]piperidin-3-yl}-1H-pyrazole-4-carboxamide US10815213, Example 140
Type:
Small organic molecule
Emp. Form.:
C27H30F2N6O3
Mol. Mass.:
524.5623
SMILES:
CN(C)C\C=C\C(=O)N1CCCC(C1)n1nc(c(C(N)=O)c1N)-c1ccc(Oc2ccc(F)cc2F)cc1
: