Target
Tyrosine-protein kinase BTK
Ligand
BDBM377869
Substrate
Meas. Tech.
Human BTK LanthaScreen Assay
IC50
1.30±n/a nM
Citation
 Springer, JRDevadas, BGarland, DJGrapperhaus, MLHan, SHockerman, SLHughes, ROSaiah, ESchnute, MESelness, SRWalker, DPWan, ZXing, LZapf, CWSchmidt, MA Bruton's tyrosine kinase inhibitors US Patent  US10266513 Publication Date 4/23/2019 
Target
Name:
Tyrosine-protein kinase BTK
Synonyms:
AGMX1 Agammaglobulinaemia tyrosine kinase B cell progenitor kinase BPK BTK_HUMAN Tyrosine Kinase BTK Tyrosine-protein kinase BTK (BTK)
Type:
Enzyme
Mol. Mass.:
76289.95
Organism:
Homo sapiens (Human)
Description:
Q06187
Residue:
659
  
Inhibitor
Name:
BDBM377869
Synonyms:
5-amino-1-{(3R)-1-[(2E)-4,4-difluorobut-2-enoyl]piperidin-3-yl}-3-(4-{[6-(trifluoromethyl)pyridin-2-yl]oxy}phenyl)-1H-pyrazole-4-carboxamide US10815213, Example 163
Type:
Small organic molecule
Emp. Form.:
C25H23F5N6O3
Mol. Mass.:
550.4805
SMILES:
NC(=O)c1c(N)n(nc1-c1ccc(Oc2cccc(n2)C(F)(F)F)cc1)C1CCCN(C1)C(=O)\C=C\C(F)F
: