Target
Epidermal growth factor receptor
Ligand
BDBM377824
Substrate
Meas. Tech.
Human EGFR LanthaScreen Selectivity Assay
IC50
>50000±n/a nM
Citation
 Springer, JRDevadas, BGarland, DJGrapperhaus, MLHan, SHockerman, SLHughes, ROSaiah, ESchnute, MESelness, SRWalker, DPWan, ZXing, LZapf, CWSchmidt, MA Bruton's tyrosine kinase inhibitors US Patent  US10266513 Publication Date 4/23/2019 
Target
Name:
Epidermal growth factor receptor
Synonyms:
EGF Receptor Substrate EGFR_HUMAN ERBB1 Epidermal Growth Factor Receptor erbB-1 Epidermal growth factor receptor (EGFR) HER1 Proto-oncogene c-ErbB-1 Tyrosine-Protein Kinase ErbB-1
Type:
Receptor Kinase Domain
Mol. Mass.:
134279.59
Organism:
Homo sapiens (Human)
Description:
P00533
Residue:
1210
  
Inhibitor
Name:
BDBM377824
Synonyms:
(R)-5-amino-3-(4-((5-chloro-3-fluoropyridin-2-yl)oxy)phenyl)-1-(1-cyanopiperidin-3-yl)-1H-pyrazole-4-carboxamide US10815213, Example 118
Type:
Small organic molecule
Emp. Form.:
C21H19ClFN7O2
Mol. Mass.:
455.873
SMILES:
NC(=O)c1c(N)n(nc1-c1ccc(Oc2ncc(Cl)cc2F)cc1)[C@@H]1CCCN(C1)C#N
: